{"text_format":"1","workbook":"xlsx","n_sheets":8,"sheets":["Instructions","Enter Information Here","Wall Poster","3-4 Format","Pool Points Calculator","Playoff Brackets","Runner Up Playoff","Results Report"],"not_rendered":{"charts":0,"images":3,"macros":1,"external_links":0,"defined_names":2,"comments":0,"pivot_tables":0},"unopened":[],"bounds":{"document_bytes":16777216,"sheet_cells":100000,"rows_first":2000,"rows_last":500,"rows_between":2000,"halvings":0,"cell_chars":16384,"cell_head_chars":4096},"cells_cut":0,"cells_raw":0,"read":"whole","date_system":"1900"}

{"sheet":"Instructions","index":0,"n_rows":26,"n_cols":7,"rows_kept":26,"cut":false,"hidden":false,"merged":[]}
[]
[null,null,null,null,null,null,"Instructions"]
[]
[null,null,"Disclaimer:  "]
[null,null,"This program was conceived my Mike McDonnell and reconfigured by Sean MacDonald into a different format.  "]
[null,null,"I (Sean) am not an Expert at Excel and it's possible there could be bugs.  Please contact the New England Region if you see a problem with the sheet"]
[null,null,"2019: I (Mike) reconfigured the reconfiguration to meet the 2019 Open Format for NERVA. There is no Substitute for the Incredible work he (Sean) Did! "]
[]
[null,null,"What's different from the old program?:"]
[]
[null,null,"1.  The new program uses a \"macro\" to function properly.  You will see a security warning near the top about disabled content. "]
[null,null,"     You must choose to enable this content for the program to work."]
[]
[null,null,"2:  The new program has a different screen to enter the scores.  Scores are entered in a way that follows the pool schedule"]
[]
[null,null,"3:  The new program will automatically breaks head to head ties that will not eliminate a team from the championship."]
[]
[null,null,"4.  If there is a 2, 3, or 4 way tie that requires a 15 point play in game, the program will fill in a bracket with the play-in teams and it lists the work team.  "]
[null,null,"     When you enter the scores of the play-in games, it will advance the winner, and when all play-in sets are complete, it will list the final pool standings"]
[null,null,"     The brackets are located below the pool standings"]
{"$rows_left_out":7}
{"sheet":"Enter Information Here","index":1,"n_rows":28,"n_cols":8,"rows_kept":28,"cut":false,"hidden":false,"merged":[[10,0,10,2]]}
[]
["Seed","Team Name"]
[1,"Team 1 Pool A",null,null,null,null,null,"Tournament Date"]
[2,"Team 1 Pool B"]
[3,"Team 2 Pool B",null,null,null,null,null,"Tournament Site"]
[4,"Team 2 Pool A"]
[5,"Team 3 Pool A",null,null,null,null,null,"Age Group"]
[6,"Team 3 Pool B"]
[7,"Team 4 Pool A",null,null,null,null,null,"Tournament Level"]
[8]
["All Times are Estimates - Times Below For 4-Team Pool",null,null,null,null,null,null,"Host Club"]
["First Match (Round 1)","09:00:00","00:50:00"]
["Round 2",{"$f":"SUM(B12+$C$12)","v":"09:50:00"},null,null,null,null,null,"Tournament Director Name"]
["Round 3",{"$f":"SUM(B13+$C$12)","v":"10:40:00"},null,null,null,null,null,"TD Phone Number"]
["Round 4",{"$f":"SUM(B14+$C$12)","v":"11:30:00"}]
["Round 5",{"$f":"SUM(B15+$C$12)","v":"12:20:00"}]
["Round 6",{"$f":"SUM(B16+$C$12)","v":"13:10:00"},null,null,null,null,null,"Results entered by"]
[null,null,null,null,null,null,null,"Email"]
["Semi-Finals Round One",{"$f":"SUM(B17+$C$12)","v":"14:00:00"},"00:35:00"]
["Semi-Finals Round Two",{"$f":"SUM(B19+$C$19)","v":"14:35:00"},"00:35:00"]
{"$rows_left_out":9}
{"sheet":"Wall Poster","index":2,"n_rows":17,"n_cols":6,"rows_kept":17,"cut":false,"hidden":false,"merged":[[9,1,9,2],[0,0,0,5],[1,0,1,5],[2,0,2,2],[3,1,3,2],[8,0,8,2]]}
["NERVA Club Tournament Format"]
[]
["Pool - B"]
["Seed","Team Name",null,null,"Won","Lost"]
[1,{"$f":"'3-4 Format'!C4","v":"Team 1 Pool B"}]
[2,{"$f":"'3-4 Format'!C5","v":"Team 2 Pool B"}]
[3,{"$f":"'3-4 Format'!C6","v":"Team 3 Pool B"}]
[]
["Pool - A"]
["Seed","Team Name",null,null,"Won","Lost"]
[1,{"$f":"'3-4 Format'!H4","v":"Team 1 Pool A"}]
[2,{"$f":"'3-4 Format'!H5","v":"Team 2 Pool A"}]
[3,{"$f":"'3-4 Format'!H6","v":"Team 3 Pool A"}]
[4,{"$f":"'3-4 Format'!H7","v":"Team 4 Pool A"}]
[]
["Pool play will be 2 - 21 point sets (Start at 4-4 and ending at 25)"]
[" Rules for implementing a cap may be announced at coaches meeting."]

{"sheet":"3-4 Format","index":3,"n_rows":90,"n_cols":12,"rows_kept":90,"cut":false,"hidden":false,"merged":[[68,8,69,8],[77,2,77,9],[84,8,85,8],[80,0,81,1],[87,0,88,1],[72,0,73,1],[4,0,4,1],[5,0,5,1],[16,0,16,1],[50,0,51,1],[23,0,23,1],[20,0,20,3],[17,0,17,1],[18,0,18,1],[19,0,19,1],[21,0,21,1],[22,0,22,1],[23,2,23,3],[61,2,61,9],[65,0,66,1],[53,8,54,8],[57,0,58,1],[6,3,6,4],[6,0,6,2],[16,2,16,3],[44,2,44,9],[46,0,46,1],[17,2,17,3],[18,2,18,3],[19,2,19,3],[21,2,21,3],[22,2,22,3],[47,6,60,6],[13,1,13,9],[0,0,0,1],[0,2,0,8],[1,2,1,7],[2,0,2,1],[3,0,3,1]]}
[{"$f":"'Enter Information Here'!B28","v":0},null," NERVA Tournament Format",null,null,null,null,null,null,{"$f":"'Enter Information Here'!B28","v":0}," "," "]
[]
["Pool Seed",null,"Pool - B","Schedule","Work Team",null,"Pool Seed","Pool - A","Schedule","Work Team"]
[1,null,{"$f":"'Enter Information Here'!B4","v":"Team 1 Pool B"},"1  vs  3",2,null,1,{"$f":"'Enter Information Here'!B3","v":"Team 1 Pool A"},"1 vs 3",2]
[2,null,{"$f":"'Enter Information Here'!B5","v":"Team 2 Pool B"},"2  vs  3",1,null,2,{"$f":"'Enter Information Here'!B6","v":"Team 2 Pool A"},"2 vs 4",1]
[3,null,{"$f":"'Enter Information Here'!B8","v":"Team 3 Pool B"},"1  vs  2",3,null,3,{"$f":"'Enter Information Here'!B7","v":"Team 3 Pool A"},"1 vs 4",3]
[null,null,null,"30 Minute Lunch Break",null,null,4,{"$f":"'Enter Information Here'!B9","v":"Team 4 Pool A"},"2 vs 3",1]
[null,null,null,"1  vs  3",2,null,null,null,"3 vs 4",2]
[null,null,null,"2  vs  3",1,null,null,null,"1 vs 2",4]
[null,null,null,"1  vs  2",3]
[]
["Pool Play"]
[]
[null,"Pool A: All matches before lunch break are 2 sets to 21 points (starting at 4). All matches after lunch are 1  set to 21 points (starting at 4). No cap unless announced."]
[null,"Pool B: All matches are 2 sets to 21 points (starting at 4). No cap unless announced prior to start of tournament."]
[]
["Work",null,"Pool B Matches",null,"Round",null,"Round","Pool A Matches","Work","Time"]
[{"$f":"C5","v":"Team 2 Pool B"},null,{"$f":"CONCATENATE(C4, \" vs \", C6)","v":"Team 1 Pool B vs Team 3 Pool B"},null,1,null,1,{"$f":"CONCATENATE(H4, \" vs \", H6)","v":"Team 1 Pool A vs Team 3 Pool A"},{"$f":"H5","v":"Team 2 Pool A"},{"$f":"'Enter Information Here'!B12","v":"09:00:00"}]
[{"$f":"C4","v":"Team 1 Pool B"},null,{"$f":"CONCATENATE(C5, \" vs \", C6)","v":"Team 2 Pool B vs Team 3 Pool B"},null,2,null,2,{"$f":"CONCATENATE(H5, \" vs \", H7)","v":"Team 2 Pool A vs Team 4 Pool A"},{"$f":"H4","v":"Team 1 Pool A"},{"$f":"'Enter Information Here'!B13","v":"09:50:00"}]
[{"$f":"C6","v":"Team 3 Pool B"},null,{"$f":"CONCATENATE(C4, \" vs \", C5)","v":"Team 1 Pool B vs Team 2 Pool B"},null,3,null,3,{"$f":"CONCATENATE(H4, \" vs \", H7)","v":"Team 1 Pool A vs Team 4 Pool A"},{"$f":"H6","v":"Team 3 Pool A"},{"$f":"'Enter Information Here'!B14","v":"10:40:00"}]
{"$rows_left_out":71}
{"sheet":"Pool Points Calculator","index":4,"n_rows":179,"n_cols":70,"rows_kept":179,"cut":false,"hidden":false,"merged":[[103,24,103,27],[105,5,105,8],[112,1,118,1],[112,2,112,3],[114,3,114,4],[114,5,114,8],[116,2,116,3],[116,5,116,8],[116,10,116,12],[118,5,118,8],[99,24,99,27],[101,5,101,8],[101,21,101,22],[101,24,101,27],[101,29,101,31],[90,2,90,3],[90,10,90,11],[97,20,103,20],[97,21,97,22],[99,1,105,1],[99,2,99,3],[99,22,99,23],[103,2,103,3],[103,5,103,8],[103,10,103,12],[101,4,106,4],[87,2,87,3],[87,10,87,11],[88,2,88,3],[88,10,88,11],[89,2,89,3],[89,10,89,11],[72,23,73,23],[72,24,73,24],[72,25,73,25],[85,1,86,1],[85,2,86,3],[85,9,86,9],[85,10,86,11],[72,3,73,3],[72,4,73,4],[72,5,73,5],[72,6,73,6],[72,22,73,22],[35,54,35,55],[35,66,35,67],[36,54,36,55],[36,66,36,67],[41,1,42,1],[41,2,42,2],[41,3,42,3],[41,4,42,4],[41,5,42,5],[41,9,42,9],[41,10,42,10],[41,11,42,11],[41,12,42,12],[41,13,42,13],[29,54,29,55],[29,66,29,67],[30,54,30,55],[30,66,30,67],[34,54,34,55],[34,66,34,67],[23,54,23,55],[23,66,23,67],[24,54,24,55],[24,66,24,67],[28,54,28,55],[28,66,28,67],[17,54,17,55],[17,66,17,67],[18,54,18,55],[18,66,18,67],[22,54,22,55],[22,66,22,67],[11,54,11,55],[11,66,11,67],[12,54,12,55],[12,66,12,67],[16,54,16,55],[16,66,16,67],[5,54,5,55],[5,66,5,67],[6,54,6,55],[6,66,6,67],[10,54,10,55],[10,66,10,67],[0,52,1,52],[0,54,1,55],[0,64,1,64],[0,66,1,67],[4,54,4,55],[4,66,4,67],[0,13,1,13],[0,1,1,2],[0,4,1,4],[0,5,1,5],[0,9,1,10],[0,12,1,12]]}
[null,"Pool B",null,null,"Set 1","Set 2",null,null,null,"Pool A",null,null,"Set 1","Set 2",null,null,null,null,null,null,null,null,null,null,null,null,null,null,null,null,null,null,null,null,null,null,null,null,null,null,null,null,null,null,null,null,null,null,null,null,null,null,"Diff",null,"H-H winner",null,null,"H-H Loser",null,null,null,null,null,null,"Diff",null,"H-H winner",null,null,"H-H Loser"]
[null,null,null,null,null,null,null,null,null,null,null,null,null,null,null,null,"Example:",null,"Set 1",null,null,null,null,null,null,null,null,null,null,null,null,null,null,null,null,null,null,null,null,null,null,null,null,null,null,null,null,null,null,null,null,null,null,null,null,null,null,null,null,null,"5+9","5+7"]
[]
[]
[null,null,{"$f":"'3-4 Format'!C4","v":"Team 1 Pool B"},null,null,null,null,null,null,null,{"$f":"'3-4 Format'!H4","v":"Team 1 Pool A"},null,null,null,null,null,"Team Pink",null,22,null,null,null,null,null,null,null,null,null,null,null,null,null,null,null,null,null,null,null,null,null,null,null,null,null,null,null,null,null,null,null,null,null,{"$f":"(E5+F5)-(E7+F7)","v":0},null,{"$f":"IF(E5>E7,1,0)+IF(F5>F7,1,0)+IF(E23>E25,1,0)","v":0},null,null,null,null,null,"7+9","7+9",null,null,{"$f":"(M5+N5)-(M7+N7)","v":0},null,{"$f":"IF(M5>M7,1,0)+IF(N5>N7,1,0)","v":0}]
[null,"Rd 1","vs",null,null,null,null,null,null,"Rd 1","vs",null,null,null,null,null,"vs",null,null,null,null,null,null,null,null,null,null,null,null,null,null,null,null,null,null,null,null,null,null,null,null,null,null,null,null,null,null,null,null,null,null,null,null,null,{"$f":"IF(BC5>BC7,C5,IF(BC7>BC5,C7,IF(BC5=1,IF(BA5>BA7,C5,IF(BA5<BA7,C7,IF(BA5=BA7,IF(F44>F46,C5,IF(F44<F46,C7,\"Flip the Coin!\"))))))))","v":false},null,14,{"$f":"IF(BC5<BC7,C5,IF(BC7<BC5,C7,IF(BC5=1,IF(BA5<BA7,C5,IF(BA5>BA7,C7,IF(BA5=BA7,IF(F44<F46,C5,IF(F44>F46,C7,\"Flip the Coin!\"))))))))","v":false},null,null,null,null,null,null,null,null,{"$f":"IF(BO5>BO7,K5,IF(BO7>BO5,K7,IF(BO5=1,IF(BM5>BM7,K5,IF(BM5<BM7,K7,IF(BM5=BM7,IF(N44>N46,K5,IF(N44<N46,K7,\"Flip the Coin!\"))))))))","v":false},null,14,{"$f":"IF(BO5<BO7,K5,IF(BO7<BO5,K7,IF(BO5=1,IF(BM5<BM7,K5,IF(BM5>BM7,K7,IF(BM5=BM7,IF(N44<N46,K5,IF(N44>N46,K7,\"Flip the Coin!\"))))))))","v":false}]
[null,null,{"$f":"'3-4 Format'!C6","v":"Team 3 Pool B"},null,null,null,null,null,null,null,{"$f":"'3-4 Format'!H6","v":"Team 3 Pool A"},null,null,null,null,null,"Team Blue",null,25,null,null,null,null,null,null,null,null,null,null,null,null,null,null,null,null,null,null,null,null,null,null,null,null,null,null,null,null,null,null,null,null,null,{"$f":"(E7+F7)-(E5+F5)","v":0},null,{"$f":"IF(E5<E7,1,0)+IF(F5<F7,1,0)+IF(E23<E25,1,0)","v":0},null,null,null,null,null,"5+7","5+9",null,null,{"$f":"(M7+N7)-(M5+N5)","v":0},null,{"$f":"IF(M5<M7,1,0)+IF(N5<N7,1,0)","v":0}]
[]
[]
[]
[null,null,{"$f":"'3-4 Format'!C5","v":"Team 2 Pool B"},null,null,null,null,null,null,null,{"$f":"'3-4 Format'!H5","v":"Team 2 Pool A"},null,null,null,null,null,"Team Blue wins Set 1,   25-22",null,null,null,null,null,null,null,null,null,null,null,null,null,null,null,null,null,null,null,null,null,null,null,null,null,null,null,null,null,null,null,null,null,null,null,{"$f":"(E11+F11)-(E13+F13)","v":0},null,{"$f":"IF(E11>E13,1,0)+IF(F11>F13,1,0)+IF(E29>E31,1,0)","v":0},null,null,null,null,null,null,null,null,null,{"$f":"(M11+N11)-(M13+N13)","v":0},null,{"$f":"IF(M11>M13,1,0)+IF(N11>N13,1,0)","v":0}]
[null,"Rd 2","vs",null,null,null,null,null,null,"Rd 2","vs",null,null,null,null,null,null,null,null,null,null,null,null,null,null,null,null,null,null,null,null,null,null,null,null,null,null,null,null,null,null,null,null,null,null,null,null,null,null,null,null,null,null,null,{"$f":"IF(BC11>BC13,C11,IF(BC13>BC11,C13,IF(BC11=1,IF(BA11>BA13,C11,IF(BA11<BA13,C13,IF(BA11=BA13,IF(F45>F46,C11,IF(F45<F46,C13,\"Flip the Coin!\"))))))))","v":false},null,16,{"$f":"IF(BC11<BC13,C11,IF(BC13<BC11,C13,IF(BC11=1,IF(BA11<BA13,C11,IF(BA11>BA13,C13,IF(BA11=BA13,IF(F45<F46,C11,IF(F45>F46,C13,\"Flip the Coin!\"))))))))","v":false},null,null,null,null,null,null,null,null,{"$f":"IF(BO11>BO13,K11,IF(BO13>BO11,K13,IF(BO11=1,IF(BM11>BM13,K11,IF(BM11<BM13,K13,IF(BM11=BM13,IF(N45>N47,K11,IF(N45<N47,K13,\"Flip the Coin!\"))))))))","v":false},null,20,{"$f":"IF(BO11<BO13,K11,IF(BO13<BO11,K13,IF(BO11=1,IF(BM11<BM13,K11,IF(BM11>BM13,K13,IF(BM11=BM13,IF(N45<N47,K11,IF(N45>N47,K13,\"Flip the Coin!\"))))))))","v":false}]
[null,null,{"$f":"'3-4 Format'!C6","v":"Team 3 Pool B"},null,null,null,null,null,null,null,{"$f":"'3-4 Format'!H7","v":"Team 4 Pool A"},null,null,null,null,null,null,null,null,null,null,null,null,null,null,null,null,null,null,null,null,null,null,null,null,null,null,null,null,null,null,null,null,null,null,null,null,null,null,null,null,null,{"$f":"(E13+F13)-(E11+F11)","v":0},null,{"$f":"IF(E11<E13,1,0)+IF(F11<F13,1,0)+IF(E29<E31,1,0)","v":0},null,null,null,null,null,null,null,null,null,{"$f":"(M13+N13)-(M11+N11)","v":0},null,{"$f":"IF(M11<M13,1,0)+IF(N11<N13,1,0)","v":0}]
[]
[]
[]
[null,null,{"$f":"'3-4 Format'!C4","v":"Team 1 Pool B"},null,null,null,null,null,null,null,{"$f":"'3-4 Format'!H4","v":"Team 1 Pool A"},null,null,null,null,null,null,null,null,null,null,null,null,null,null,null,null,null,null,null,null,null,null,null,null,null,null,null,null,null,null,null,null,null,null,null,null,null,null,null,null,null,{"$f":"(E17+F17)-(E19+F19)","v":0},null,{"$f":"IF(E17>E19,1,0)+IF(F17>F19,1,0)+IF(E35>E37,1,0)","v":0},null,null,null,null,null,null,null,null,null,{"$f":"(M17+N17)-(M19+N19)","v":0},null,{"$f":"IF(M17>M19,1,0)+IF(N17>N19,1,0)","v":0}]
[null,"Rd 3","vs",null,null,null,null,null,null,"Rd 3","vs",null,null,null,null,null,null,null,null,null,null,null,null,null,null,null,null,null,null,null,null,null,null,null,null,null,null,null,null,null,null,null,null,null,null,null,null,null,null,null,null,null,null,null,{"$f":"IF(BC17>BC19,C17,IF(BC19>BC17,C19,IF(BC17=1,IF(BA17>BA19,C17,IF(BA17<BA19,C19,IF(BA17=BA19,IF(F44>F45,C17,IF(F44<F45,C19,\"Flip the Coin!\"))))))))","v":false},null,12,{"$f":"IF(BC17<BC19,C17,IF(BC19<BC17,C19,IF(BC17=1,IF(BA17<BA19,C17,IF(BA17>BA19,C19,IF(BA17=BA19,IF(F44<F45,C17,IF(F44>F45,C19,\"Flip the Coin!\"))))))))","v":false},null,null,null,null,null,null,null,null,{"$f":"IF(BO17>BO19,K17,IF(BO19>BO17,K19,IF(BO17=1,IF(BM17>BM19,K17,IF(BM17<BM19,K19,IF(BM17=BM19,IF(N44>N47,K17,IF(N44<N47,K19,\"Flip the Coin!\"))))))))","v":false},null,18,{"$f":"IF(BO17<BO19,K17,IF(BO19<BO17,K19,IF(BO17=1,IF(BM17<BM19,K17,IF(BM17>BM19,K19,IF(BM17=BM19,IF(N44<N47,K17,IF(N44>N47,K19,\"Flip the Coin!\"))))))))","v":false}]
[null,null,{"$f":"'3-4 Format'!C5","v":"Team 2 Pool B"},null,null,null,null,null,null,null,{"$f":"'3-4 Format'!H7","v":"Team 4 Pool A"},null,null,null,null,null,null,null,null,null,null,null,null,null,null,null,null,null,null,null,null,null,null,null,null,null,null,null,null,null,null,null,null,null,null,null,null,null,null,null,null,null,{"$f":"(E19+F19)-(E17+F17)","v":0},null,{"$f":"IF(E17<E19,1,0)+IF(F17<F19,1,0)+IF(E35<E37,1,0)","v":0},null,null,null,null,null,null,null,null,null,{"$f":"(M19+N19)-(M17+N17)","v":0},null,{"$f":"IF(M17<M19,1,0)+IF(N17<N19,1,0)","v":0}]
[]
{"$rows_left_out":160}
{"sheet":"Playoff Brackets","index":5,"n_rows":47,"n_cols":26,"rows_kept":47,"cut":false,"hidden":false,"merged":[[1,9,2,10],[10,9,18,10],[7,9,8,10],[20,9,21,10],[48,1,48,4],[11,1,11,4],[17,1,17,4],[20,1,20,4],[20,6,20,8],[20,11,20,14],[23,1,23,4],[38,12,38,16],[28,0,28,2],[38,17,38,18],[30,1,30,4],[33,1,33,4],[33,6,33,8],[33,11,33,14],[36,1,36,4],[39,19,39,22],[42,1,42,4],[45,1,45,4],[45,6,45,8],[45,11,45,14],[39,13,39,16],[13,17,13,18],[14,13,14,16],[14,19,14,22],[5,1,5,4],[8,1,8,4],[8,6,8,8],[8,11,8,14],[13,12,13,16],[10,25,10,27],[11,25,11,27],[5,25,5,27],[6,25,6,27],[7,25,7,27],[8,25,8,27],[9,25,9,27]]}
[]
[null,null,null,null,null,null,null,null,null,"Runner Up Match"]
[null,"Champion Bracket",null,null,null,null,null,null,null,null,null,null,null,null,null,null,null,null,null,null,null,null,null,null,null,"Final Results"]
[null,null,null,null,null,null,"Set 1","Set 2","Set 3",null,null,null,null,null,null,null,"Set 1","Set 2 ","Set 3"]
[]
[null,{"$f":"'Pool Points Calculator'!C88","v":""},null,null,null,{"$f":"IF(G6>G12,1,0)+IF(H6>H12,1,0)+IF(I6>I12,1,0)","v":0},null,null,null,null,null,null,null,null,null,null,null,null,null,null,null,null,null,null,"1st",{"$f":"T15","v":""}]
[null,"1st in Pool B",null,null,null,null,null,null,null,null,null,null,null,null,null,null,null,null,null,null,null,null,null,null,"2nd",{"$f":"IF(P9<P21,L9,IF(P21<P9,L21,\"\"))","v":""}]
[null,null,null,null,null,null,null,null,null,{"$f":"'Runner Up Playoff'!B4","v":" "},null,null,null,null,null,null,null,null,null,null,null,null,null,null,"3rd",{"$f":"'Runner Up Playoff'!J7","v":""}]
[null,{"$f":"'Pool Points Calculator'!C89","v":""},null,null,null,null,"Work team",null,null,null,null,{"$f":"IF(G12>0,IF(F6>F12,B6,IF(F12>F6,B12,\"\")),\"\")","v":""},null,null,null,{"$f":"IF(Q9>Q21,1,0)+IF(R9>R21,1,0)+IF(S9>S21,1,0)","v":0},null,null,null,null,null,null,null,null,"4th",{"$f":"'Runner Up Playoff'!J8","v":""}]
["Semi #1",null,null,null,null,null,null,null,null,null,null,null,null,null,null,null,null,null,null,null,null,null,null,null,"5th",{"$f":"IF(P34>P46,L34,IF(P46>P34,L46,\"\"))","v":""}]
["1 set to 25",null,null,null,null,null,null,null,null,"Runner Up Match Played Here - See Tab Below",null,null,null,null,null,null,null,null,null,null,null,null,null,null,"6th",{"$f":"IF(P34<P46,L34,IF(P46<P34,L46,\"\"))","v":""}]
[null,{"$f":"'Pool Points Calculator'!K89","v":""},null,null,null,{"$f":"IF(G6<G12,1,0)+IF(H6<H12,1,0)+IF(I6<I12,1,0)","v":0},null,null,null,null,null,null,null,null,null,null,null,null,null,null,null,null,null,null,"7th",{"$f":"M39","v":""}]
[null,"2nd in Pool A"]
[null,null,null,null,null,null,null,null,null,null,null,null,{"$f":"IF(G24>0,IF(F18<F24,B18,IF(F24<F18,B24,\"\")),\"\")","v":""},null,null,null,null,"Work team"]
[null,null,null,null,null,null,null,null,null,null,null,"Final",null,null,null,null,null,null,null,{"$f":"IF(P9>P21,L9,IF(P21>P9,L21,\"\"))","v":""}]
[null,null,null,null,null,null,"Set 1","Set 2 ","Set 3",null,null,"1 set to 25"]
[null,null,null,null,null,null,null,null,null,null,null,null,null,null,null,null,null,null,null,null,"Tournament Champion"]
[null,{"$f":"'Pool Points Calculator'!C89","v":""},null,null,null,{"$f":"IF(G18>G24,1,0)+IF(H18>H24,1,0)+IF(I18>I24,1,0)","v":0}]
[null,"2nd in Pool B"]
[]
{"$rows_left_out":28}
{"sheet":"Runner Up Playoff","index":6,"n_rows":11,"n_cols":16,"rows_kept":11,"cut":false,"hidden":false,"merged":[[0,14,1,18],[6,9,6,11],[7,9,7,11],[9,1,9,4],[0,0,0,8],[3,1,3,4],[6,1,6,4],[6,6,6,8]]}
["Championship Runer Up Bracket (3rd & 4th)",null,null,null,null,null,null,null,null,null,null,null,null,null,"Runner Up Results"]
[null,null,null,null,null,null,"Set 1","Set 2","Set 3"]
[null,null,null,null,null,null,null,null,null,null,null,null,null,null,"3rd",{"$f":"J7","v":""}]
[null,{"$f":"IF('Playoff Brackets'!L9<>\"\",(IF('Playoff Brackets'!L9='Playoff Brackets'!B6,'Playoff Brackets'!B12,'Playoff Brackets'!B6)),\" \")","v":" "},null,null,null,{"$f":"IF(G4>G10,1,0)+IF(H4>H10,1,0)+IF(I4>I10,1,0)","v":0},null,null,null,null,null,null,null,null,"4th",{"$f":"J8","v":""}]
[null,"Loser Semi #1"]
[]
[null," AND/OR ",null,null,null,null,"Work team",null,null,{"$f":"IF(G10>0,IF(F4>F10,B4,IF(F10>F4,B10,\"\")),\"\")","v":""},null,null,"3rd Place"]
["Semi #1",null,null,null,null,null,null,null,null,{"$f":"IF(G10>0,IF(F4<F10,B4,IF(F10<F4,B10,\"\")),\"\")","v":""},null,null,"4th Place"]
[]
[null,{"$f":"IF('Playoff Brackets'!L21<>\"\",(IF('Playoff Brackets'!L21='Playoff Brackets'!B18,'Playoff Brackets'!B24,'Playoff Brackets'!B18)),\" \")","v":" "},null,null,null,{"$f":"IF(G4<G10,1,0)+IF(H4<H10,1,0)+IF(I4<I10,1,0)","v":0}]
[null,"Loser Semi #2"]

{"sheet":"Results Report","index":7,"n_rows":182,"n_cols":8,"rows_kept":182,"cut":false,"hidden":true,"merged":[]}
[]
[null,null,"Results Entry Sheet",null,null,"Age Group",null,{"$f":"'Enter Information Here'!I7","v":0}]
[]
[]
[null,null,"Tournament Date",null,"Number of teams in the Tournament"]
[null,null,{"$f":"'Enter Information Here'!I3","v":"00:00:00"},null,8]
[]
[null,null,"Tournament Site",null,"Host Club"]
[null,null,{"$f":"'Enter Information Here'!I5","v":"00:00:00"},null,{"$f":"'Enter Information Here'!I11","v":"00:00:00"}]
[]
[null,null,"Tournament Level",null,"Person entering Results"]
[null,null,{"$f":"'Enter Information Here'!I9","v":"00:00:00"},null,{"$f":"'Enter Information Here'!I17","v":"00:00:00"}]
[]
[null,null,"Tournament Director Name",null,"Email"]
[null,null,{"$f":"'Enter Information Here'!I13","v":"00:00:00"},null,{"$f":"'Enter Information Here'!I18","v":"00:00:00"}]
[]
[null,null,"TD Phone Number"]
[null,null,{"$f":"'Enter Information Here'!I14","v":"00:00:00"}]
[]
[]
{"$rows_left_out":162}